BDBM50350485 CHEMBL1814497
SMILES CC(C)[C@H](N)C(=O)N[C@@H](C)C(=O)N[C@@H]([C@@H](C)O)C(=O)N[C@@H](C)C(=O)N[C@@H](C)C(O)=O
InChI Key InChIKey=ONSUKXKWMBCVEZ-PJGZEUCASA-N
Data  1 KI
  Tab Delimited (TSV)   2D SDfile   Computed 3D by Vconf -m prep SDfile
Find this compound or compounds like it in BindingDB:
Activity Spreadsheet -- Enzyme Inhibition Constant Data from BindingDB
Found 1 hit for monomerid = 50350485
TargetSolute carrier family 15 member 2(Homo sapiens (Human))
Universit£
Curated by ChEMBL
LigandPNGBDBM50350485(CHEMBL1814497)
Affinity DataKi:  1.10E+5nM. Assay description: Binding affinity to human PepT2 in SKTP cells
In DepthDetails ArticlePubMed