BDBM50350577 CHEMBL1812904
SMILES CNC(=O)c1ccc2c(c1)c(-c1ccccc1)c(CN)n(CC(C)C)c2=O
InChI Key InChIKey=WOAGDDDUVDBZSA-UHFFFAOYSA-N
Data  1 IC50
  Tab Delimited (TSV)   2D SDfile   Computed 3D by Vconf -m prep SDfile
Find this compound or compounds like it in BindingDB:
Activity Spreadsheet -- Enzyme Inhibition Constant Data from BindingDB
Found 1 hit for monomerid = 50350577
TargetDipeptidyl peptidase 4(Homo sapiens (Human))
Takeda Pharmaceutical
Curated by ChEMBL
LigandPNGBDBM50350577(CHEMBL1812904)
Affinity DataIC50:  1.90E+3nM. Assay description: Inhibition of human DPP4 isolated from from human CaCo2 cells incubated for 15 mins using Gly-Pro-pNA.Tos substrate
In DepthDetails ArticlePubMed