BDBM50350584 CHEMBL1812734
SMILES CCCn1c(CN)c(-c2ccccc2)c2cc(Cl)ccc2c1=O
InChI Key InChIKey=HYTRUJPRWGLOBZ-UHFFFAOYSA-N
Data  1 IC50
  Tab Delimited (TSV)   2D SDfile   Computed 3D by Vconf -m prep SDfile
Find this compound or compounds like it in BindingDB:
Activity Spreadsheet -- Enzyme Inhibition Constant Data from BindingDB
Found 1 hit for monomerid = 50350584
TargetDipeptidyl peptidase 4(Homo sapiens (Human))
Takeda Pharmaceutical
Curated by ChEMBL
LigandPNGBDBM50350584(CHEMBL1812734)
Affinity DataIC50:  2.40E+3nM. Assay description: Inhibition of human DPP4 isolated from from human CaCo2 cells incubated for 15 mins using Gly-Pro-pNA.Tos substrate
In DepthDetails ArticlePubMed