BDBM50350886 CHEMBL1819553
SMILES CC[C@H](C)[C@@H]1NC(=O)[C@H](CC(C)C)NC(=O)[C@@H](N)CSSC[C@H](NC(=O)[C@H](CC(N)=O)NC(=O)[C@H](CCC(N)=O)NC1=O)C(=O)N1CCC[C@H]1C(=O)N[C@@H](CCN)C(=O)NCC(N)=O
InChI Key InChIKey=RVEZLDNCHVLZPH-IHEWHSJKSA-N
Data  4 EC50
  Tab Delimited (TSV)   2D SDfile   Computed 3D by Vconf -m prep SDfile
Find this compound or compounds like it in BindingDB:
Activity Spreadsheet -- Enzyme Inhibition Constant Data from BindingDB
Found 4 hits for monomerid = 50350886
TargetVasopressin V1a receptor(Homo sapiens (Human))
Ferring Research Institute
Curated by ChEMBL
LigandPNGBDBM50350886(CHEMBL1819553)
Affinity DataEC50:  13nM. Assay description: Agonist activity at recombinant human vasopressin V1a receptor expressed in HEK293 cells by luciferase reporter gene assay
In DepthDetails ArticlePubMed
TargetVasopressin V1b receptor(Homo sapiens (Human))
Ferring Research Institute
Curated by ChEMBL
LigandPNGBDBM50350886(CHEMBL1819553)
Affinity DataEC50:  250nM. Assay description: Agonist activity at recombinant human vasopressin V1b receptor expressed in Flp-In-293 cells by luciferase reporter gene assay
In DepthDetails ArticlePubMed
TargetOxytocin receptor(Homo sapiens (Human))
Ferring Research Institute
Curated by ChEMBL
LigandPNGBDBM50350886(CHEMBL1819553)
Affinity DataEC50: >1.00E+4nM. Assay description: Agonist activity at human OT receptor expressed in CHO-K1 cells by luciferase reporter gene assay
In DepthDetails ArticlePubMed
TargetVasopressin V2 receptor(Homo sapiens (Human))
Ferring Research Institute
Curated by ChEMBL
LigandPNGBDBM50350886(CHEMBL1819553)
Affinity DataEC50:  1.20E+3nM. Assay description: Agonist activity at recombinant human vasopressin V2 receptor expressed in HEK293 cells by luciferase reporter gene assay
In DepthDetails ArticlePubMed