BDBM50350910 CHEMBL1817964
SMILES COc1oc(\C=C\C(C)C\C=C\C(\C)=C\C(C)C(O[C@@H]2O[C@H](CO)[C@@H](O)[C@H](O)[C@H]2O)C(\C)=C\C)c(C)c(=O)c1C
InChI Key InChIKey=HUWRGLWOOQKCCY-UNNKBTQVSA-N
Data  3 IC50
  Tab Delimited (TSV)   2D SDfile   Computed 3D by Vconf -m prep SDfile
Find this compound or compounds like it in BindingDB:
Activity Spreadsheet -- Enzyme Inhibition Constant Data from BindingDB
Found 3 hits for monomerid = 50350910
TargetEpidermal growth factor receptor(Homo sapiens (Human))
Pharmamar Sau
Curated by ChEMBL
LigandPNGBDBM50350910(CHEMBL1817964)
Affinity DataIC50:  160nM. Assay description: Inhibition of EGFR-induced AP1 activation in human HeLa cells preincubated for 1 hr prior to EGF stimulation by luciferase reporter gene assay
In DepthDetails ArticlePubMed
TargetEpidermal growth factor receptor(Homo sapiens (Human))
Pharmamar Sau
Curated by ChEMBL
LigandPNGBDBM50350910(CHEMBL1817964)
Affinity DataIC50:  170nM. Assay description: Inhibition of EGFR-induced Beta-catenin activation in human HeLa cells preincubated for 1 hr prior to EGF stimulation by luciferase reporter gene ass...
In DepthDetails ArticlePubMed
TargetEpidermal growth factor receptor(Homo sapiens (Human))
Pharmamar Sau
Curated by ChEMBL
LigandPNGBDBM50350910(CHEMBL1817964)
Affinity DataIC50:  60nM. Assay description: Inhibition of EGFR-induced HIF1alpha activation in human HeLa cells preincubated for 1 hr prior to EGF stimulation by luciferase reporter gene assay
In DepthDetails ArticlePubMed