BDBM50351202 CHEMBL1818378
SMILES [O-][N+](=O)CCC(=O)N1CCN(CC1)c1cccc(c1)C(F)(F)F
InChI Key InChIKey=MTGWJPLOJFNTKP-UHFFFAOYSA-N
Data  1 IC50
  Tab Delimited (TSV)   2D SDfile   Computed 3D by Vconf -m prep SDfile
Find this compound or compounds like it in BindingDB:
Activity Spreadsheet -- Enzyme Inhibition Constant Data from BindingDB
Found 1 hit for monomerid = 50351202
TargetIsocitrate lyase(Mycobacterium tuberculosis)
Institute Of Technology And Science-Pilani
Curated by ChEMBL
LigandPNGBDBM50351202(CHEMBL1818378)
Affinity DataIC50:  3.02E+4nM. Assay description: Inhibition of Mycobacterium tuberculosis isocitrate lyase
In DepthDetails ArticlePubMed