BDBM50351378 CHEMBL1819068
SMILES CCC(CC)Nc1c2CCCc2nc2c(c(nn12)C1CCC1)-c1ccc(OC)cc1C
InChI Key InChIKey=JCYYMKXKOHMNFK-UHFFFAOYSA-N
Data  1 IC50
  Tab Delimited (TSV)   2D SDfile   Computed 3D by Vconf -m prep SDfile
Find this compound or compounds like it in BindingDB:
Activity Spreadsheet -- Enzyme Inhibition Constant Data from BindingDB
Found 1 hit for monomerid = 50351378
TargetCorticotropin-releasing factor receptor 1(Homo sapiens (Human))
Minase Research Institute
Curated by ChEMBL
LigandPNGBDBM50351378(CHEMBL1819068)
Affinity DataIC50:  490nM. Assay description: Displacement of [125I]CRF from human corticotropin-releasing factor receptor 1 expressed in CHO-K1 cells after 2 hrs by gamma counting
In DepthDetails ArticlePubMed