BDBM50351398 CHEMBL1819088
SMILES CCC(CC)Nc1c2CCOc2nc2c(c(C)nn12)-c1ccc(OC)cc1Cl
InChI Key InChIKey=YBMGGKSGVALVNU-UHFFFAOYSA-N
Data  1 IC50  1 EC50
  Tab Delimited (TSV)   2D SDfile   Computed 3D by Vconf -m prep SDfile
Find this compound or compounds like it in BindingDB:
Activity Spreadsheet -- Enzyme Inhibition Constant Data from BindingDB
Found 2 hits for monomerid = 50351398
TargetCorticotropin-releasing factor receptor 1(Homo sapiens (Human))
Minase Research Institute
Curated by ChEMBL
LigandPNGBDBM50351398(CHEMBL1819088)
Affinity DataEC50:  8nM. Assay description: Antagonist activity at human corticotropin-releasing factor receptor 1 expressed in CHO-K1 cells assessed as inhibition of CRF-induced cAMP productio...
In DepthDetails ArticlePubMed
TargetCorticotropin-releasing factor receptor 1(Homo sapiens (Human))
Minase Research Institute
Curated by ChEMBL
LigandPNGBDBM50351398(CHEMBL1819088)
Affinity DataIC50:  84nM. Assay description: Displacement of [125I]CRF from human corticotropin-releasing factor receptor 1 expressed in CHO-K1 cells after 2 hrs by gamma counting
In DepthDetails ArticlePubMed