BDBM50351771 CHEMBL1823504
SMILES CCCCCCCS(=O)(=O)NCC#Cc1cn([C@H]2C[C@H](O)[C@@H](COP([O-])([O-])=O)O2)c(=O)[nH]c1=O
InChI Key InChIKey=IRZNYKQPPOUTKS-GVDBMIGSSA-L
Data  2 IC50
  Tab Delimited (TSV)   2D SDfile   Computed 3D by Vconf -m prep SDfile
Find this compound or compounds like it in BindingDB:
Activity Spreadsheet -- Enzyme Inhibition Constant Data from BindingDB
Found 2 hits for monomerid = 50351771
TargetFlavin-dependent thymidylate synthase(Mycobacterium tuberculosis)
Katholieke Universiteit Leuven
Curated by ChEMBL
LigandPNGBDBM50351771(CHEMBL1823504)
Affinity DataIC50:  6.93E+3nM. Assay description: Inhibition of Mycobacterium tuberculosis ThyX-mediated dTMP synthesis using [5-3H]dUMP as substrate after 10 mins by liquid scintillation counting
In DepthDetails ArticlePubMed
TargetThymidylate synthase ThyA(Mycobacterium tuberculosis)
Katholieke Universiteit Leuven
Curated by ChEMBL
LigandPNGBDBM50351771(CHEMBL1823504)
Affinity DataIC50: >5.00E+4nM. Assay description: Inhibition of Mycobacterium tuberculosis His-tagged ThyA-mediated dTMP synthesis expressed in BL21 (DE3) Escherichia coli RbCl cells after 30 mins by...
In DepthDetails ArticlePubMed