BDBM50351857 CHEMBL1825018
SMILES C(c1ccccc1)n1ccnn1
InChI Key InChIKey=VRDSRXVCRBMZOD-UHFFFAOYSA-N
Data  1 IC50
  Tab Delimited (TSV)   2D SDfile   Computed 3D by Vconf -m prep SDfile
Find this compound or compounds like it in BindingDB:
Activity Spreadsheet -- Enzyme Inhibition Constant Data from BindingDB
Found 1 hit for monomerid = 50351857
TargetAromatase(Homo sapiens (Human))
Universit£
Curated by ChEMBL
LigandPNGBDBM50351857(CHEMBL1825018)
Affinity DataIC50:  1.19E+4nM. Assay description: Inhibition of aromatase using 7-methoxy-4-trifluoromethyl coumarin as substrate after 30 mins by fluorescence-based colorimetric analysis
In DepthDetails ArticlePubMed