BDBM50351894 CHEMBL1821789
SMILES COc1cc(Cc2nccc3cc(OC)c(OC)cc23)ccc1OCCF
InChI Key InChIKey=VIXPZCCXTICVDE-UHFFFAOYSA-N
Data  3 IC50
  Tab Delimited (TSV)   2D SDfile   Computed 3D by Vconf -m prep SDfile
Find this compound or compounds like it in BindingDB:
Activity Spreadsheet -- Enzyme Inhibition Constant Data from BindingDB
Found 3 hits for monomerid = 50351894
TargetcAMP and cAMP-inhibited cGMP 3',5'-cyclic phosphodiesterase 10A(Homo sapiens (Human))
Washington University
Curated by ChEMBL
LigandPNGBDBM50351894(CHEMBL1821789)
Affinity DataIC50:  55nM. Assay description: Inhibition of human recombinant PDE10A assessed as reduction in hydrolysis of [3H]cAMP by scintillation proximity assay
In DepthDetails ArticlePubMed
TargetcGMP-inhibited 3',5'-cyclic phosphodiesterase 3B(Homo sapiens (Human))
Washington University
Curated by ChEMBL
LigandPNGBDBM50351894(CHEMBL1821789)
Affinity DataIC50:  2.17E+3nM. Assay description: Inhibition of PDE3B assessed as reduction in hydrolysis of [3H]cAMP by scintillation proximity assay
In DepthDetails ArticlePubMed
TargetcGMP-inhibited 3',5'-cyclic phosphodiesterase 3A(Homo sapiens (Human))
Washington University
Curated by ChEMBL
LigandPNGBDBM50351894(CHEMBL1821789)
Affinity DataIC50:  1.74E+3nM. Assay description: Inhibition of PDE3A assessed as reduction in hydrolysis of [3H]cAMP by scintillation proximity assay
In DepthDetails ArticlePubMed