BDBM50351906 CHEMBL1821780
SMILES COc1ccc(Cc2nccc3cc(OC)c(OCCF)cc23)c(F)c1
InChI Key InChIKey=QLUAKIGJRWDMDK-UHFFFAOYSA-N
Data  1 IC50
  Tab Delimited (TSV)   2D SDfile   Computed 3D by Vconf -m prep SDfile
Find this compound or compounds like it in BindingDB:
Activity Spreadsheet -- Enzyme Inhibition Constant Data from BindingDB
Found 1 hit for monomerid = 50351906
TargetcAMP and cAMP-inhibited cGMP 3',5'-cyclic phosphodiesterase 10A(Homo sapiens (Human))
Washington University
Curated by ChEMBL
LigandPNGBDBM50351906(CHEMBL1821780)
Affinity DataIC50:  500nM. Assay description: Inhibition of human recombinant PDE10A assessed as reduction in hydrolysis of [3H]cAMP by scintillation proximity assay
In DepthDetails ArticlePubMed