BDBM50352161 CHEMBL1824791
SMILES CC(C)(C)OC(=O)N[C@@H](CCCCNC(=O)OCc1ccccc1Cl)C(=O)Oc1ccc(cc1)[N+]([O-])=O
InChI Key InChIKey=XQGKAKKXKDUYJS-NRFANRHFSA-N
Data  1 KI  1 IC50
  Tab Delimited (TSV)   2D SDfile   Computed 3D by Vconf -m prep SDfile
Find this compound or compounds like it in BindingDB:
Activity Spreadsheet -- Enzyme Inhibition Constant Data from BindingDB
Found 2 hits for monomerid = 50352161
TargetGlutathione reductase, mitochondrial(Homo sapiens (Human))
Batman University
Curated by ChEMBL
LigandPNGBDBM50352161(CHEMBL1824791)
Affinity DataKi:  4.16E+3nM. Assay description: Non-Competitive inhibition of human erythrocyte Glutathione reductase using GSSG substrate by Lineweaver-Burk plot analysis
In DepthDetails ArticlePubMed
TargetGlutathione reductase, mitochondrial(Homo sapiens (Human))
Batman University
Curated by ChEMBL
LigandPNGBDBM50352161(CHEMBL1824791)
Affinity DataIC50:  1.54E+4nM. Assay description: Inhibition of human erythrocyte Glutathione reductase
In DepthDetails ArticlePubMed