BDBM50352392 CHEMBL1823577
SMILES CCN(CC)C(=O)[C@H](N1CCN(CC1)c1ccc(NC(=O)c2ccccc2-c2cccnc2)cc1F)c1ccccc1
InChI Key InChIKey=OVUNRYUVDVWTTE-JGCGQSQUSA-N
Data  1 IC50
  Tab Delimited (TSV)   2D SDfile   Computed 3D by Vconf -m prep SDfile
Find this compound or compounds like it in BindingDB:
Activity Spreadsheet -- Enzyme Inhibition Constant Data from BindingDB
Found 1 hit for monomerid = 50352392
TargetNeuropeptide Y receptor type 2(Homo sapiens (Human))
Johnson & Johnson Pharmaceutical Research & Development
Curated by ChEMBL
LigandPNGBDBM50352392(CHEMBL1823577)
Affinity DataIC50:  9nM. Assay description: Displacement of [125I]PYY from human NPY Y2 receptor expressed endogenously in KAN-Ts cells by scintillation counting
In DepthDetails ArticlePubMed