BDBM50352681 CHEMBL1823095::US8835436, Example 105
SMILES COc1cc(OC)cc(c1)-n1c(C)nc(C(=O)NCCCN2CCN(CC2)c2cccc(C)c2C)c1C
InChI Key InChIKey=GQSLSFIXXDXGCZ-UHFFFAOYSA-N
Data  6 IC50
  Tab Delimited (TSV)   2D SDfile   Computed 3D by Vconf -m prep SDfile
Find this compound or compounds like it in BindingDB:
Activity Spreadsheet -- Enzyme Inhibition Constant Data from BindingDB
Found 6 hits for monomerid = 50352681
Target5-hydroxytryptamine receptor 2A(Homo sapiens (Human))
Green Cross
US Patent
LigandPNGBDBM50352681(CHEMBL1823095 | US8835436, Example 105)
Affinity DataIC50:  32nMpH: 7.4Assay Description:For serotonin 5-HT2A binding, an aliquot of human recombinant serotonin 5-HT2A receptor (PerkinElmer Life and Analytical Sciences, USA) expressed in ...
In DepthDetails US Patent
Target5-hydroxytryptamine receptor 2C(Homo sapiens (Human))
Green Cross
US Patent
LigandPNGBDBM50352681(CHEMBL1823095 | US8835436, Example 105)
Affinity DataIC50:  159nMpH: 7.4Assay Description:For serotonin 5-HT2A binding, an aliquot of human recombinant serotonin 5-HT2A receptor (PerkinElmer Life and Analytical Sciences, USA) expressed in ...
In DepthDetails US Patent
TargetSodium-dependent serotonin transporter(Homo sapiens (Human))
Green Cross
Curated by ChEMBL
LigandPNGBDBM50352681(CHEMBL1823095 | US8835436, Example 105)
Affinity DataIC50:  10nM. Assay description: Displacement of [3H]impiramine from human serotonin transporter membrane expressed in HEK293 cells
In DepthDetails ArticlePubMed
Target5-hydroxytryptamine receptor 2A(Homo sapiens (Human))
Green Cross
US Patent
LigandPNGBDBM50352681(CHEMBL1823095 | US8835436, Example 105)
Affinity DataIC50:  32nM. Assay description: Displacement of [3H]ketanserin from human recombinant serotonin 5-HT2A receptor expressed in CHO-K1 cells
In DepthDetails ArticlePubMed
Target5-hydroxytryptamine receptor 2C(Homo sapiens (Human))
Green Cross
US Patent
LigandPNGBDBM50352681(CHEMBL1823095 | US8835436, Example 105)
Affinity DataIC50:  159nM. Assay description: Displacement of [3H]mesulergine from human recombinant 5-HT2C receptor expressed in CHO-K1 cells
In DepthDetails ArticlePubMed
TargetSodium-dependent serotonin transporter(Homo sapiens (Human))
Green Cross
Curated by ChEMBL
LigandPNGBDBM50352681(CHEMBL1823095 | US8835436, Example 105)
Affinity DataIC50:  10nMpH: 7.4Assay Description:For serotonin transporter binding assays, a reaction mixture with a final volume of 0.25 ml was prepared by mixing a test compound, human serotonin t...
In DepthDetails US Patent