BDBM50352801 CHEMBL1823405
SMILES Cn1nc(ccc1=O)-c1ccc(cc1)N1CCN(CC1)C1CCCC1
InChI Key InChIKey=BADBSYKFOODGTN-UHFFFAOYSA-N
Data  2 KI
  Tab Delimited (TSV)   2D SDfile   Computed 3D by Vconf -m prep SDfile
Find this compound or compounds like it in BindingDB:
Activity Spreadsheet -- Enzyme Inhibition Constant Data from BindingDB
Found 2 hits for monomerid = 50352801
TargetHistamine H3 receptor(Homo sapiens (Human))
Cephalon
Curated by ChEMBL
LigandPNGBDBM50352801(CHEMBL1823405)
Affinity DataKi:  93nM. Assay description: Displacement of [3H]-NAMH from human histamine H3 receptor
In DepthDetails ArticlePubMed
TargetHistamine H3 receptor(Rattus norvegicus (rat))
Cephalon
Curated by ChEMBL
LigandPNGBDBM50352801(CHEMBL1823405)
Affinity DataKi:  255nM. Assay description: Displacement of [3H]-NAMH from rat histamine H3 receptor
In DepthDetails ArticlePubMed