BDBM50352977 CHEMBL1824951
SMILES CC[C@H]1CN(CCN1)C(=O)c1c(Oc2c(C)cccc2C)n(-c2ccccc2)c2cccnc12
InChI Key InChIKey=KNUIWMFAPWCYTC-NRFANRHFSA-N
Data  1 IC50
  Tab Delimited (TSV)   2D SDfile   Computed 3D by Vconf -m prep SDfile
Find this compound or compounds like it in BindingDB:
Activity Spreadsheet -- Enzyme Inhibition Constant Data from BindingDB
Found 1 hit for monomerid = 50352977
TargetRenin(Homo sapiens (Human))
Deutschland
Curated by ChEMBL
LigandPNGBDBM50352977(CHEMBL1824951)
Affinity DataIC50:  455nM. Assay description: Inhibition of human recombinant renin using dabcyl-gamma-Abu-Ile-His-Pro-Phe-His-Leu-Val-Ile-His-Thr-EDANS as substrate preincubated for 30 mins afte...
In DepthDetails ArticlePubMed