BDBM50353009 CHEMBL1825198
SMILES CN(C)\C=N\NS(=O)(=O)c1ccccc1
InChI Key InChIKey=XGXZGTOFLKZQHB-CSKARUKUSA-N
Data  1 IC50
  Tab Delimited (TSV)   2D SDfile   Computed 3D by Vconf -m prep SDfile
Find this compound or compounds like it in BindingDB:
Activity Spreadsheet -- Enzyme Inhibition Constant Data from BindingDB
Found 1 hit for monomerid = 50353009
TargetBranched-chain-amino-acid aminotransferase, cytosolic(Homo sapiens (Human))
Abbott Laboratories
Curated by ChEMBL
LigandPNGBDBM50353009(CHEMBL1825198)
Affinity DataIC50:  1.50E+5nM. Assay description: Inhibition of human recombinant histidine-tagged BCATc expressed in Escherichia coli BL21 (DE3) after 50 mins using [13C]-L-leucine as substrate by N...
In DepthDetails ArticlePubMed