BDBM50353050 CHEMBL1822512
SMILES C1CN(CCO1)c1ccc(Nc2ncc3ccc(-c4ccccc4)n3n2)cc1
InChI Key InChIKey=LUGGNKDLZYNKFK-UHFFFAOYSA-N
Data  2 IC50
  Tab Delimited (TSV)   2D SDfile   Computed 3D by Vconf -m prep SDfile
Find this compound or compounds like it in BindingDB:
Activity Spreadsheet -- Enzyme Inhibition Constant Data from BindingDB
Found 2 hits for monomerid = 50353050
TargetALK tyrosine kinase receptor(Homo sapiens (Human))
Cephalon
Curated by ChEMBL
LigandPNGBDBM50353050(CHEMBL1822512)
Affinity DataIC50: >2.00E+3nM. Assay description: Inhibition of human recombinant ALK assessed as phosphorylated product using PLC-gamma/GST substrate by modified ELISA method
In DepthDetails ArticlePubMed
TargetInsulin receptor(Homo sapiens (Human))
Cephalon
Curated by ChEMBL
LigandPNGBDBM50353050(CHEMBL1822512)
Affinity DataIC50:  194nM. Assay description: Inhibition of IR
In DepthDetails ArticlePubMed