BDBM50353099 CHEMBL1829134
SMILES COc1ccc(CN2CCN(CCCOc3ccc(cc3NC(=O)c3ccc(cc3)C(F)(F)F)C(=O)NC(N)=N)CC2)c(OC)c1OC
InChI Key InChIKey=JCSZWUZQDJYAEG-UHFFFAOYSA-N
Data  1 IC50
  Tab Delimited (TSV)   2D SDfile   Computed 3D by Vconf -m prep SDfile
Find this compound or compounds like it in BindingDB:
Activity Spreadsheet -- Enzyme Inhibition Constant Data from BindingDB
Found 1 hit for monomerid = 50353099
TargetSodium/hydrogen exchanger 1(Rattus norvegicus)
China Pharmaceutical University
Curated by ChEMBL
LigandPNGBDBM50353099(CHEMBL1829134)
Affinity DataIC50:  1.10nM. Assay description: Inhibition of NHE1 in Sprague-Dawley rat assessed as inhibition of acid-induced platelet swelling by spectrophotometric analysis
In DepthDetails ArticlePubMed