BDBM50353434 CHEMBL1829867::US10196373, Compound 45L
SMILES CN(CC(=O)N(Cc1ccc(cc1)C1CCCCC1)c1ccc(C(O)=O)c(O)c1)S(=O)(=O)c1ccc(F)cc1
InChI Key InChIKey=XBDRHDBYNHJQTM-UHFFFAOYSA-N
Data  2 IC50
  Tab Delimited (TSV)   2D SDfile   Computed 3D by Vconf -m prep SDfile
Find this compound or compounds like it in BindingDB:
Activity Spreadsheet -- Enzyme Inhibition Constant Data from BindingDB
Found 2 hits for monomerid = 50353434
TargetSignal transducer and activator of transcription 3(Homo sapiens (Human))
The Governing Council Of The University Of Toronto
US Patent
LigandPNGBDBM50353434(CHEMBL1829867 | US10196373, Compound 45L)
Affinity DataIC50: >3.00E+5nM. Assay description: ChIP assay was performed using EZ ChIP Kit (Millipore, Billerica, Mass., USA) as per manufacturer's instruction. Briefly, after crosslinking with...
In DepthDetails US Patent
TargetSignal transducer and activator of transcription 3(Mus musculus (mouse))
University Of Toronto Mississauga
Curated by ChEMBL
LigandPNGBDBM50353434(CHEMBL1829867 | US10196373, Compound 45L)
Affinity DataIC50: >3.00E+5nM. Assay description: Inhibition of STAT3 in mouse NIH3T3/vSrc nuclear extract assessed as disruption of the Stat3-DNA complex pre-incubated for 30 mins by EMSA analysis
In DepthDetails ArticlePubMed