BDBM50353636 CHEMBL1829802
SMILES Oc1c(NCc2cccc(CCNS(=O)(=O)c3ccc(Cl)cc3)c2)c(=O)c1=O
InChI Key InChIKey=CVPOHUCKSJLQHL-UHFFFAOYSA-N
Data  2 IC50  2 Kd
  Tab Delimited (TSV)   2D SDfile   Computed 3D by Vconf -m prep SDfile
Find this compound or compounds like it in BindingDB:
Activity Spreadsheet -- Enzyme Inhibition Constant Data from BindingDB
Found 4 hits for monomerid = 50353636
TargetThromboxane A2 receptor(Homo sapiens (Human))
University Of Pennsylvania
Curated by ChEMBL
LigandPNGBDBM50353636(CHEMBL1829802)
Affinity DataKd:  359nM. Assay description: Displacement of [3H]SQ-29548 from human prostanoid TP receptor expressed in QBI-HEK 293A cells after 2 hrs by scintillation proximity assay
In DepthDetails ArticlePubMed
TargetThromboxane A2 receptor(MOUSE)
University Of Pennsylvania
Curated by ChEMBL
LigandPNGBDBM50353636(CHEMBL1829802)
Affinity DataIC50:  91nM. Assay description: Antagonist activity at mouse prostanoid TP receptor expressed in QBI-HEK 293A cells assessed as inhibition of 1-BOP-induced increase in inositol mono...
In DepthDetails ArticlePubMed
TargetThromboxane A2 receptor(Homo sapiens (Human))
University Of Pennsylvania
Curated by ChEMBL
LigandPNGBDBM50353636(CHEMBL1829802)
Affinity DataIC50:  377nM. Assay description: Antagonist activity at human prostanoid TP receptor expressed in QBI-HEK 293A cells assessed as inhibition of 1-BOP-induced increase in inositol mono...
In DepthDetails ArticlePubMed
TargetThromboxane A2 receptor(MOUSE)
University Of Pennsylvania
Curated by ChEMBL
LigandPNGBDBM50353636(CHEMBL1829802)
Affinity DataKd:  17nM. Assay description: Displacement of [3H]SQ-29548 from mouse prostanoid TP receptor expressed in QBI-HEK 293A cells after 2 hrs by scintillation proximity assay
In DepthDetails ArticlePubMed