BDBM50353931 CHEMBL1830875
SMILES CNC[C@H](CCN1c2ccccc2N(c2ccccc2)S1(=O)=O)OC
InChI Key InChIKey=LFTRJEGVGRCFEP-INIZCTEOSA-N
Data  3 IC50
  Tab Delimited (TSV)   2D SDfile   Computed 3D by Vconf -m prep SDfile
Find this compound or compounds like it in BindingDB:
Activity Spreadsheet -- Enzyme Inhibition Constant Data from BindingDB
Found 3 hits for monomerid = 50353931
TargetSodium-dependent dopamine transporter(Homo sapiens (Human))
Pfizer
Curated by ChEMBL
LigandPNGBDBM50353931(CHEMBL1830875)
Affinity DataIC50:  1.04E+3nM. Assay description: Displacement of [3H]-WIN-35428 from human DAT expressed in CHO cells
In DepthDetails ArticlePubMed
TargetSodium-dependent noradrenaline transporter(Homo sapiens (Human))
Pfizer
Curated by ChEMBL
LigandPNGBDBM50353931(CHEMBL1830875)
Affinity DataIC50:  151nM. Assay description: Inhibition of human NET expressed in MDCK-Net6 cells assessed as inhibition of norepinephrine uptake
In DepthDetails ArticlePubMed
TargetSodium-dependent noradrenaline transporter(Homo sapiens (Human))
Pfizer
Curated by ChEMBL
LigandPNGBDBM50353931(CHEMBL1830875)
Affinity DataIC50:  103nM. Assay description: Displacement of [3H]nisoxetine from human NET expressed in MDCK-Net6 cells
In DepthDetails ArticlePubMed