BDBM50354008 CHEMBL1828893
SMILES CCCCc1c(Nc2ccc(OC)cc2Cl)nc2ccnn2c1N(CCC)CCC
InChI Key InChIKey=KHVAQLWJZHQVAE-UHFFFAOYSA-N
Data  1 IC50
  Tab Delimited (TSV)   2D SDfile   Computed 3D by Vconf -m prep SDfile
Find this compound or compounds like it in BindingDB:
Activity Spreadsheet -- Enzyme Inhibition Constant Data from BindingDB
Found 1 hit for monomerid = 50354008
TargetCorticotropin-releasing factor receptor 1(Homo sapiens (Human))
Minase Research Institute
Curated by ChEMBL
LigandPNGBDBM50354008(CHEMBL1828893)
Affinity DataIC50:  340nM. Assay description: Displacement of [125I]-CRF from human CRF1 receptor expressed in CHO-K1 cells after 2 hrs by gamma counting
In DepthDetails ArticlePubMed