BDBM50354228 CHEMBL1835990
SMILES Cc1nc2ccccc2n1-c1ccc(cc1)C(=O)N[C@@H]1CCN(C1)C1CCCC1
InChI Key InChIKey=KEKBUHHPINWJRM-LJQANCHMSA-N
Data  1 KI
  Tab Delimited (TSV)   2D SDfile   Computed 3D by Vconf -m prep SDfile
Find this compound or compounds like it in BindingDB:
Activity Spreadsheet -- Enzyme Inhibition Constant Data from BindingDB
Found 1 hit for monomerid = 50354228
TargetHistamine H3 receptor(Homo sapiens (Human))
Pfizer
Curated by ChEMBL
LigandPNGBDBM50354228(CHEMBL1835990)
Affinity DataKi:  197nM. Assay description: Displacement of [3H]-(R)alpha-methylhistamine from human histamine H3 receptor expressed in human HEK293T cells
In DepthDetails ArticlePubMed