BDBM50354261 CHEMBL1836563
SMILES CC1=Nc2ccc(Cl)cc2C(N1CCN1CCN(CC1)C(=O)OC(C)(C)C)c1ccccc1
InChI Key InChIKey=ISTGOQSKRPIJRK-UHFFFAOYSA-N
Data  1 IC50
  Tab Delimited (TSV)   2D SDfile   Computed 3D by Vconf -m prep SDfile
Find this compound or compounds like it in BindingDB:
Activity Spreadsheet -- Enzyme Inhibition Constant Data from BindingDB
Found 1 hit for monomerid = 50354261
TargetTrypanothione reductase(Trypanosoma brucei brucei)
University Of Dundee
Curated by ChEMBL
LigandPNGBDBM50354261(CHEMBL1836563)
Affinity DataIC50:  1.50E+3nM. Assay description: Inhibition of recombinant trypanothione reductase from Trypanosoma brucei brucei S427 by DTNB-coupled spectrophotometric assay
In DepthDetails ArticlePubMed