BDBM50354358 CHEMBL1836472
SMILES Nc1ncnc2sc3CCCc3c12
InChI Key InChIKey=VHROFEHOOFIVDR-UHFFFAOYSA-N
Data  2 IC50
  Tab Delimited (TSV)   2D SDfile   Computed 3D by Vconf -m prep SDfile
Find this compound or compounds like it in BindingDB:
Activity Spreadsheet -- Enzyme Inhibition Constant Data from BindingDB
Found 2 hits for monomerid = 50354358
TargetLIM domain kinase 1(Homo sapiens (Human))
The Walter And Eliza Hall Institute Of Medical Research
Curated by ChEMBL
LigandPNGBDBM50354358(CHEMBL1836472)
Affinity DataIC50:  5.30E+3nM. Assay description: Inhibition of LIMK1 using cofilin-2 as substrate after 60 mins by Kinase-Glo assay
In DepthDetails ArticlePubMed
TargetLIM domain kinase 1(Homo sapiens (Human))
The Walter And Eliza Hall Institute Of Medical Research
Curated by ChEMBL
LigandPNGBDBM50354358(CHEMBL1836472)
Affinity DataIC50:  5.30E+3nM. Assay description: Inhibition of LIMK1 using cofilin-2 as substrate after 60 mins by TR-FRET assay
In DepthDetails ArticlePubMed