BDBM50354457 CHEMBL1836841
SMILES Cc1cn2c(cnc2c(Nc2ccc(C(=O)N3C[C@@H]4CC[C@H](C3)N4)c(Cl)c2)n1)-c1cn[nH]c1
InChI Key InChIKey=JDWRBLXGJZCOBR-CALCHBBNSA-N
Data  4 IC50
  Tab Delimited (TSV)   2D SDfile   Computed 3D by Vconf -m prep SDfile
Find this compound or compounds like it in BindingDB:
Activity Spreadsheet -- Enzyme Inhibition Constant Data from BindingDB
Found 4 hits for monomerid = 50354457
TargetAurora kinase B(Homo sapiens (Human))
Merck Research Laboratories
Curated by ChEMBL
LigandPNGBDBM50354457(CHEMBL1836841)
Affinity DataIC50:  242nM. Assay description: Inhibition of AurB
In DepthDetails ArticlePubMed
TargetProtein-tyrosine kinase 6(Homo sapiens (Human))
Merck Research Laboratories
Curated by ChEMBL
LigandPNGBDBM50354457(CHEMBL1836841)
Affinity DataIC50:  177nM. Assay description: Inhibition of phosphorylated SAM68 in 293 WT-PTK6 cells after 3 hrs
In DepthDetails ArticlePubMed
TargetProtein-tyrosine kinase 6(Homo sapiens (Human))
Merck Research Laboratories
Curated by ChEMBL
LigandPNGBDBM50354457(CHEMBL1836841)
Affinity DataIC50:  11nM. Assay description: Inhibition of BRK pretreated for 30 mins by microplate reader
In DepthDetails ArticlePubMed
TargetTyrosine-protein kinase Lck(Homo sapiens (Human))
Merck Research Laboratories
Curated by ChEMBL
LigandPNGBDBM50354457(CHEMBL1836841)
Affinity DataIC50:  3.21E+3nM. Assay description: Inhibition of LCK
In DepthDetails ArticlePubMed