BDBM50354497 CHEMBL410225
SMILES CCC1(CCCCN2CCC(=CC2)c2ccc(F)cc2)C(=O)Nc2ccccc12
InChI Key InChIKey=RMOZCWNCXKCYBI-UHFFFAOYSA-N
Data  2 KI
  Tab Delimited (TSV)   2D SDfile   Computed 3D by Vconf -m prep SDfile
Find this compound or compounds like it in BindingDB:
Activity Spreadsheet -- Enzyme Inhibition Constant Data from BindingDB
Found 2 hits for monomerid = 50354497
Target5-hydroxytryptamine receptor 7(Homo sapiens (Human))
Egis Pharmaceuticals
Curated by ChEMBL
LigandPNGBDBM50354497(CHEMBL410225)
Affinity DataKi:  1.19nM. Assay description: Displacement of [3H]LSD from human recombinant 5HT7 receptor expressed in CHO cells
In DepthDetails ArticlePubMed
Target5-hydroxytryptamine receptor 7(Homo sapiens (Human))
Egis Pharmaceuticals
Curated by ChEMBL
LigandPNGBDBM50354497(CHEMBL410225)
Affinity DataKi:  1.20nM. Assay description: Displacement of [3H]CT from human 5-HT7 receptor expressed in CHO cells by scintillation spectrometry
In DepthDetails ArticlePubMed