BDBM50354826 CHEMBL1834091
SMILES Cc1ccc(cc1)S(=O)(=O)c1cc(C)nc(N)n1
InChI Key InChIKey=XUOYIZBDMDPDEJ-UHFFFAOYSA-N
Data  1 IC50  1 Kd
PDB links: 1 PDB ID matches this monomer.
  Tab Delimited (TSV)   2D SDfile   Computed 3D by Vconf -m prep SDfile
Find this compound or compounds like it in BindingDB:
Activity Spreadsheet -- Enzyme Inhibition Constant Data from BindingDB
Found 2 hits for monomerid = 50354826
TargetHeat shock protein HSP 90-alpha(Homo sapiens (Human))
Chugai Pharmaceutical
Curated by ChEMBL
LigandPNGBDBM50354826(CHEMBL1834091)
Affinity DataIC50:  9.60E+3nM. Assay description: Inhibition of human N-terminal GST-tagged HSP90alpha expressed in Escherichia coli after 1 hr using 10 mM of ATP and malachite green by microplate re...Checked by Author
TargetHeat shock protein HSP 90-alpha(Homo sapiens (Human))
Chugai Pharmaceutical
Curated by ChEMBL
LigandPNGBDBM50354826(CHEMBL1834091)
Affinity DataKd:  860nM. Assay description: Binding affinity to human HSP90alpha assessed as 2D1H-15N chemical shift perturbation by NMR spectroscopyChecked by Author