BDBM50354857 CHEMBL1834538
SMILES C[C@]12C[C@H](O)[C@@]3(F)[C@@H](C[C@H](F)C4=CC(=O)C=C[C@]34C)[C@@H]1C[C@H]1O[C@H](O[C@@]21C(=O)CO)c1ccc(Cc2ccc(O)cc2)cc1
InChI Key InChIKey=YFRPXMQJHJXXJV-BFQQSILCSA-N
Data  1 EC50
  Tab Delimited (TSV)   2D SDfile   Computed 3D by Vconf -m prep SDfile
Find this compound or compounds like it in BindingDB:
Activity Spreadsheet -- Enzyme Inhibition Constant Data from BindingDB
Found 1 hit for monomerid = 50354857
TargetGlucocorticoid receptor(Homo sapiens (Human))
Pfizer
Curated by ChEMBL
LigandPNGBDBM50354857(CHEMBL1834538)
Affinity DataEC50:  0.380nM. Assay description: Agonist activity at GR in human SW1353 cells transfected with luciferase gene linked to MMTV promoter assessed as luciferase transactivation activity
In DepthDetails ArticlePubMed