BDBM50355630 CHEMBL1910864
SMILES CC(C)(CCC(C(N)=O)(c1ccccc1)c1ccccc1)N1CC(C1)Oc1cc(O)c(Cl)cc1Cl
InChI Key InChIKey=JHFOPISWTBENTQ-UHFFFAOYSA-N
Data  1 KI
  Tab Delimited (TSV)   2D SDfile   Computed 3D by Vconf -m prep SDfile
Find this compound or compounds like it in BindingDB:
Activity Spreadsheet -- Enzyme Inhibition Constant Data from BindingDB
Found 1 hit for monomerid = 50355630
TargetMuscarinic acetylcholine receptor M3(Homo sapiens (Human))
Pfizer
Curated by ChEMBL
LigandPNGBDBM50355630(CHEMBL1910864)
Affinity DataKi:  7.30nM. Assay description: Antagonist activity at human recombinant M3 receptor expressed in CHO-K1 cells assessed as inhibition of carbamoyl choline-induced calcium currents a...
In DepthDetails ArticlePubMed