BDBM50355695 CHEMBL1909655
SMILES CCCOc1cccc2n(c(nc12)C(F)F)-c1nc(nc(n1)N1CCOCC1)N1CCOCC1
InChI Key InChIKey=DQTXTMOGBROIGO-UHFFFAOYSA-N
Data  2 IC50
  Tab Delimited (TSV)   2D SDfile   Computed 3D by Vconf -m prep SDfile
Find this compound or compounds like it in BindingDB:
Activity Spreadsheet -- Enzyme Inhibition Constant Data from BindingDB
Found 2 hits for monomerid = 50355695
TargetPhosphatidylinositol 4,5-bisphosphate 3-kinase catalytic subunit beta isoform(Homo sapiens (Human))
University Of Auckland
Curated by ChEMBL
LigandPNGBDBM50355695(CHEMBL1909655)
Affinity DataIC50:  518nM. Assay description: Inhibition of human recombinant PI3K p110beta expressed in Sf21 insect cells using phosphatidylinositol as substrate after 1 hr by phosphoimaging
In DepthDetails ArticlePubMed
TargetPhosphatidylinositol 4,5-bisphosphate 3-kinase catalytic subunit alpha isoform(Mus musculus (Mouse))
University Of Auckland
Curated by ChEMBL
LigandPNGBDBM50355695(CHEMBL1909655)
Affinity DataIC50:  16nM. Assay description: Inhibition of mouse recombinant PI3K p110alpha expressed in Sf21 insect cells using phosphatidylinositol as substrate after 1 hr by phosphoimaging
In DepthDetails ArticlePubMed