BDBM50355819 CHEMBL1912059
SMILES Clc1ccc2c(NCCCNC(=O)CCCC[C@@H]3CCSS3)c3CCCCc3nc2c1
InChI Key InChIKey=QVGXTQPZHCDXRZ-GOSISDBHSA-N
Data  2 IC50
  Tab Delimited (TSV)   2D SDfile   Computed 3D by Vconf -m prep SDfile
Find this compound or compounds like it in BindingDB:
Activity Spreadsheet -- Enzyme Inhibition Constant Data from BindingDB
Found 2 hits for monomerid = 50355819
TargetCholinesterase(Homo sapiens (Human))
University Of Bologna
Curated by ChEMBL
LigandPNGBDBM50355819(CHEMBL1912059)
Affinity DataIC50:  12.6nM. Assay description: Inhibition of human serum recombinant BChE after 20 mins using butyrylthiocholine iodide as a substrate by Ellman's assay
In DepthDetails ArticlePubMed
TargetAcetylcholinesterase(Homo sapiens (Human))
University Of Bologna
Curated by ChEMBL
LigandPNGBDBM50355819(CHEMBL1912059)
Affinity DataIC50:  0.230nM. Assay description: Inhibition of human serum recombinant AChE after 20 mins using acetylthiocholine iodide as a substrate by Ellman's assay
In DepthDetails ArticlePubMed