BDBM50355873 CHEMBL1910016
SMILES O=CCN1c2ccccc2C(=NC(NC(=O)\C=C\c2ccc3ccccc3c2)C1=O)c1ccccc1
InChI Key InChIKey=KOPBQJORRCABMU-BMRADRMJSA-N
Data  1 IC50
  Tab Delimited (TSV)   2D SDfile   Computed 3D by Vconf -m prep SDfile
Find this compound or compounds like it in BindingDB:
Activity Spreadsheet -- Enzyme Inhibition Constant Data from BindingDB
Found 1 hit for monomerid = 50355873
TargetSentrin-specific protease 1(Homo sapiens (Human))
Shanghai Jiao Tong University
Curated by ChEMBL
LigandPNGBDBM50355873(CHEMBL1910016)
Affinity DataIC50:  2.18E+4nM. Assay description: Inhibition of histidine-tagged human SENP1 catalytic domain preincubated for 10 mins by SUMO-CHOP-PLA2 reporter fluorescence assay
In DepthDetails ArticlePubMed