BDBM50356171 CHEMBL1087842
SMILES NC(=S)NCCc1ccccc1
InChI Key InChIKey=OFVGPHQYOCKLLM-UHFFFAOYSA-N
Data  1 IC50  1 Kd
  Tab Delimited (TSV)   2D SDfile   Computed 3D by Vconf -m prep SDfile
Find this compound or compounds like it in BindingDB:
Activity Spreadsheet -- Enzyme Inhibition Constant Data from BindingDB
Found 2 hits for monomerid = 50356171
TargetReverse transcriptase(Human immunodeficiency virus 1)
Beactica
Curated by ChEMBL
LigandPNGBDBM50356171(CHEMBL1087842)
Affinity DataKd:  7.00E+5nM. Assay description: Binding affinity to HIV1 reverse transcriptase by surface plasmon resonance based biosensor assay
In DepthDetails ArticlePubMed
TargetPolyphenol oxidase 2(Agaricus bisporus (Common mushroom))
Chungnam National University
Curated by ChEMBL
LigandPNGBDBM50356171(CHEMBL1087842)
Affinity DataIC50: >1.00E+5nM. Assay description: Inhibition of mushroom tyrosinase activity using L-tyrosine as substrate by spectrometric analysis
In DepthDetails ArticlePubMed