BDBM50356387 CHEMBL1911437
SMILES Fc1cccc(F)c1Cn1cc(C(=O)Nc2ccc(cc2)C(=O)N2CCOCC2)c(=O)c2[nH]c(=O)ccc12
InChI Key InChIKey=JNBFORLQLVKROC-UHFFFAOYSA-N
Data  2 IC50
  Tab Delimited (TSV)   2D SDfile   Computed 3D by Vconf -m prep SDfile
Find this compound or compounds like it in BindingDB:
Activity Spreadsheet -- Enzyme Inhibition Constant Data from BindingDB
Found 2 hits for monomerid = 50356387
TargetHigh affinity cAMP-specific 3',5'-cyclic phosphodiesterase 7A(Homo sapiens (Human))
Biocrea
Curated by ChEMBL
LigandPNGBDBM50356387(CHEMBL1911437)
Affinity DataIC50:  188nM. Assay description: Inhibition of human recombinant PDE7A1 expressed in baculovirus infected insect Sf21 cells after 30 mins by scintillation proximity assay
In DepthDetails ArticlePubMed
TargetcAMP-specific 3',5'-cyclic phosphodiesterase 4A(Homo sapiens (Human))
Biocrea
Curated by ChEMBL
LigandPNGBDBM50356387(CHEMBL1911437)
Affinity DataIC50:  1.06E+3nM. Assay description: Inhibition of human recombinant PDE4A4 expressed in baculovirus infected insect Sf21 cells after 30 mins by scintillation proximity assay
In DepthDetails ArticlePubMed