BDBM50356411 CHEMBL1911550
SMILES COc1cc(NC(=O)c2cn(Cc3ccccc3F)c3ccc(=O)[nH]c3c2=O)cc(OC)c1OC
InChI Key InChIKey=QEPLZHHTJKDYDV-UHFFFAOYSA-N
Data  2 IC50
  Tab Delimited (TSV)   2D SDfile   Computed 3D by Vconf -m prep SDfile
Find this compound or compounds like it in BindingDB:
Activity Spreadsheet -- Enzyme Inhibition Constant Data from BindingDB
Found 2 hits for monomerid = 50356411
TargetHigh affinity cAMP-specific 3',5'-cyclic phosphodiesterase 7A(Homo sapiens (Human))
Biocrea
Curated by ChEMBL
LigandPNGBDBM50356411(CHEMBL1911550)
Affinity DataIC50:  206nM. Assay description: Inhibition of human recombinant PDE7A1 expressed in baculovirus infected insect Sf21 cells after 30 mins by scintillation proximity assay
In DepthDetails ArticlePubMed
TargetcAMP-specific 3',5'-cyclic phosphodiesterase 4A(Homo sapiens (Human))
Biocrea
Curated by ChEMBL
LigandPNGBDBM50356411(CHEMBL1911550)
Affinity DataIC50: >1.00E+3nM. Assay description: Inhibition of human recombinant PDE4A4 expressed in baculovirus infected insect Sf21 cells after 30 mins by scintillation proximity assay
In DepthDetails ArticlePubMed