BDBM50356502 CHEMBL1911988
SMILES CN(CCNC(=O)c1cc(C)nc(n1)-n1ccnc1)Cc1ccc2OCOc2c1
InChI Key InChIKey=SPTBHBVYPVCTMD-UHFFFAOYSA-N
Data  3 EC50
  Tab Delimited (TSV)   2D SDfile   Computed 3D by Vconf -m prep SDfile
Find this compound or compounds like it in BindingDB:
Activity Spreadsheet -- Enzyme Inhibition Constant Data from BindingDB
Found 3 hits for monomerid = 50356502
TargetNitric oxide synthase, inducible(Homo sapiens (Human))
Kalypsys
Curated by ChEMBL
LigandPNGBDBM50356502(CHEMBL1911988)
Affinity DataEC50: >1.00E+5nM. Assay description: Inhibition of human iNOS expressed in human HEK293 cells assessed as nitrite accumulation after 18 hrs by 2,3-diaminonapthalene assay
In DepthDetails ArticlePubMed
TargetNitric oxide synthase, endothelial(Homo sapiens (Human))
Kalypsys
Curated by ChEMBL
LigandPNGBDBM50356502(CHEMBL1911988)
Affinity DataEC50: >1.00E+5nM. Assay description: Inhibition of human eNOS expressed in HEK293 cells assessed as inhibition A23187-induced nitric oxide production incubated for 24 hrs measured after ...
In DepthDetails ArticlePubMed
TargetNitric oxide synthase, brain(Homo sapiens (Human))
Kalypsys
Curated by ChEMBL
LigandPNGBDBM50356502(CHEMBL1911988)
Affinity DataEC50: >1.00E+5nM. Assay description: Inhibition of human nNOS expressed in HEK293 cells assessed as inhibition ionomycin-induced nitric oxide production incubated for 24 hrs measured aft...
In DepthDetails ArticlePubMed