BDBM50356610 CHEMBL1910142
SMILES Oc1ccccc1N1CCN(CCN(C(=O)C23CC4CC(CC(CF)(C4)C2)C3)c2ccccn2)CC1
InChI Key InChIKey=APYUJYHMHJCFKN-UHFFFAOYSA-N
Data  1 KI  1 IC50
  Tab Delimited (TSV)   2D SDfile   Computed 3D by Vconf -m prep SDfile
Find this compound or compounds like it in BindingDB:
Activity Spreadsheet -- Enzyme Inhibition Constant Data from BindingDB
Found 2 hits for monomerid = 50356610
Target5-hydroxytryptamine receptor 1A(Homo sapiens (Human))
Vu University Medical Center
Curated by ChEMBL
LigandPNGBDBM50356610(CHEMBL1910142)
Affinity DataKi:  1.10nM. Assay description: Displacement of [3H]8-OH-DPAT from human 5HT1A receptor expressed in HEK293 EBNA cells after 2 hrs by liquid scintillation counting
In DepthDetails ArticlePubMed
Target5-hydroxytryptamine receptor 1A(Homo sapiens (Human))
Vu University Medical Center
Curated by ChEMBL
LigandPNGBDBM50356610(CHEMBL1910142)
Affinity DataIC50:  2.59nM. Assay description: Displacement of [3H]8-OH-DPAT from human 5HT1A receptor expressed in HEK293 EBNA cells after 2 hrs by liquid scintillation counting
In DepthDetails ArticlePubMed