BDBM50356649 CHEMBL1917392
SMILES OC(=O)COc1ccc(Cl)cc1C#Cc1ccccc1F
InChI Key InChIKey=DHLREDDYCCSATA-UHFFFAOYSA-N
Data  1 KI
  Tab Delimited (TSV)   2D SDfile   Computed 3D by Vconf -m prep SDfile
Find this compound or compounds like it in BindingDB:
Activity Spreadsheet -- Enzyme Inhibition Constant Data from BindingDB
Found 1 hit for monomerid = 50356649
TargetProstaglandin D2 receptor 2(Homo sapiens (Human))
Merck Serono
Curated by ChEMBL
LigandPNGBDBM50356649(CHEMBL1917392)
Affinity DataKi:  47nM. Assay description: Displacement of [3H]PGD2 from human CRTH2 expressed in chinese hamster CHO cells by liquid scintillation counting
In DepthDetails ArticlePubMed