BDBM50356695 CHEMBL1917610
SMILES COCCNS(=O)(=O)c1ccc(C)c(c1)C#Cc1cc(Cl)ccc1OCC(O)=O
InChI Key InChIKey=HZLZJBCEVLUEPY-UHFFFAOYSA-N
Data  1 KI  1 IC50
  Tab Delimited (TSV)   2D SDfile   Computed 3D by Vconf -m prep SDfile
Find this compound or compounds like it in BindingDB:
Activity Spreadsheet -- Enzyme Inhibition Constant Data from BindingDB
Found 2 hits for monomerid = 50356695
TargetProstaglandin D2 receptor 2(Homo sapiens (Human))
Merck Serono
Curated by ChEMBL
LigandPNGBDBM50356695(CHEMBL1917610)
Affinity DataKi:  3.60nM. Assay description: Displacement of [3H]PGD2 from human CRTH2 expressed in chinese hamster CHO cells by liquid scintillation counting
In DepthDetails ArticlePubMed
TargetProstaglandin D2 receptor 2(Homo sapiens (Human))
Merck Serono
Curated by ChEMBL
LigandPNGBDBM50356695(CHEMBL1917610)
Affinity DataIC50:  88nM. Assay description: Antagonist activity at CRTH2 in human blood cells assessed as inhibition of PGD2-induced eosinophil cell shape change after 10 mins by flow cytometry
In DepthDetails ArticlePubMed