BDBM50356766 CHEMBL1917825
SMILES COc1ccc2nc3CCCCc3c(NCCCC=C)c2c1
InChI Key InChIKey=SUYXUDHQNHYYJQ-UHFFFAOYSA-N
Data  2 IC50
  Tab Delimited (TSV)   2D SDfile   Computed 3D by Vconf -m prep SDfile
Find this compound or compounds like it in BindingDB:
Activity Spreadsheet -- Enzyme Inhibition Constant Data from BindingDB
Found 2 hits for monomerid = 50356766
TargetCholinesterase(Homo sapiens (Human))
Charles University In Prague
Curated by ChEMBL
LigandPNGBDBM50356766(CHEMBL1917825)
Affinity DataIC50:  1.10E+3nM. Assay description: Inhibition of human plasmatic BChE after 5 mins using spectrophotometer by Ellman's method
In DepthDetails ArticlePubMed
TargetAcetylcholinesterase(Homo sapiens (Human))
Charles University In Prague
Curated by ChEMBL
LigandPNGBDBM50356766(CHEMBL1917825)
Affinity DataIC50:  2.20E+3nM. Assay description: Inhibition of human recombinant AChE after 5 mins using spectrophotometer by Ellman's method
In DepthDetails ArticlePubMed