BDBM50356919 CHEMBL1915760
SMILES C[C@H](CC\C=C(/C)C(O)=O)[C@H]1CC[C@@]2(C)C3=CC[C@H]4C(C)(C)[C@@H](O)CC[C@]4(C)C3=CC[C@]12C
InChI Key InChIKey=HUTCYUJPLOTDMX-SPPZYOJVSA-N
Data  4 IC50
  Tab Delimited (TSV)   2D SDfile   Computed 3D by Vconf -m prep SDfile
Find this compound or compounds like it in BindingDB:
Activity Spreadsheet -- Enzyme Inhibition Constant Data from BindingDB
Found 4 hits for monomerid = 50356919
Target3-hydroxy-3-methylglutaryl-coenzyme A reductase(Sus scrofa)
Chinese Academy Of Sciences
Curated by ChEMBL
LigandPNGBDBM50356919(CHEMBL1915760)
Affinity DataIC50:  8.60E+3nM. Assay description: Inhibition of pig liver microsomes HMG-CoA reductase incubated for 5 mins in using HMG-CoA and NADPH by colorimetric method
In DepthDetails ArticlePubMed
TargetAcetylcholinesterase(Homo sapiens (Human))
Shaanxi University Of Science & Technology
Curated by ChEMBL
LigandPNGBDBM50356919(CHEMBL1915760)
Affinity DataIC50:  2.11E+4nM. Assay description: Inhibition of AChE (unknown origin) using acetylthiocholine iodide as substrate preincubated for 20 mins followed by substrate addition measured afte...
In DepthDetails ArticlePubMed
TargetCholinesterase(Homo sapiens (Human))
Chungnam National University
Curated by ChEMBL
LigandPNGBDBM50356919(CHEMBL1915760)
Affinity DataIC50: >2.00E+5nM. Assay description: Inhibition of BChE assessed as hydrolysis of butrylcholine preincubated for 15 mins measured after 15 mins by colorimetric Ellman assay
In DepthDetails ArticlePubMed
TargetAcetylcholinesterase(Homo sapiens (Human))
Shaanxi University Of Science & Technology
Curated by ChEMBL
LigandPNGBDBM50356919(CHEMBL1915760)
Affinity DataIC50:  2.11E+4nM. Assay description: Inhibition of AChE assessed as hydrolysis of acetylcholine preincubated for 15 mins measured after 15 mins by colorimetric Ellman assay
In DepthDetails ArticlePubMed