BDBM50356938 CHEMBL1916048
SMILES Cc1cc(C)n2nc(N)cc2n1
InChI Key InChIKey=JTTOBYJUZIFSFJ-UHFFFAOYSA-N
Data  1 IC50
PDB links: 1 PDB ID matches this monomer.
  Tab Delimited (TSV)   2D SDfile   Computed 3D by Vconf -m prep SDfile
Find this compound or compounds like it in BindingDB:
Activity Spreadsheet -- Enzyme Inhibition Constant Data from BindingDB
Found 1 hit for monomerid = 50356938
LigandPNGBDBM50356938(CHEMBL1916048)
Affinity DataIC50:  9.15E+5nM. Assay description: Inhibition of recombinant human PI3Kgamma assessed as depletion of ATP by kinase-glo luciferase assay