BDBM50357065 CHEMBL1917232
SMILES CN1CCC[C@H]1[C@H]1COc2ccc(O)cc2O1
InChI Key InChIKey=OHYANMWFAIMESB-GXFFZTMASA-N
Data  5 KI
  Tab Delimited (TSV)   2D SDfile   Computed 3D by Vconf -m prep SDfile
Find this compound or compounds like it in BindingDB:
Activity Spreadsheet -- Enzyme Inhibition Constant Data from BindingDB
Found 5 hits for monomerid = 50357065
TargetNeuronal acetylcholine receptor subunit alpha-3/beta-4(Homo sapiens (Human))
Universit£
Curated by ChEMBL
LigandPNGBDBM50357065(CHEMBL1917232)
Affinity DataKi:  310nM. Assay description: Displacement of [3H](-)cytisine from rat whole brain alpha4beta2 nAChR
In DepthDetails ArticlePubMed
TargetNeuronal acetylcholine receptor subunit alpha-4/beta-2(Rattus norvegicus (Rat))
Universit£
Curated by ChEMBL
LigandPNGBDBM50357065(CHEMBL1917232)
Affinity DataKi:  420nM. Assay description: Displacement of [3H]-Epibatidine from alpha4beta2 nAChR in rat cerebral cortex membrane preincubated for 5 mins followed by [3H]-Epibatidine addition...
In DepthDetails ArticlePubMed
TargetNeuronal acetylcholine receptor subunit alpha-3/beta-4(Homo sapiens (Human))
Universit£
Curated by ChEMBL
LigandPNGBDBM50357065(CHEMBL1917232)
Affinity DataKi:  700nM. Assay description: Displacement of [3H]-epibatidine from human alpha3beta4 transfected in HEK293 cell membranes preincubated for 5 mins followed by [3H]-epibatidine add...
In DepthDetails ArticlePubMed
TargetNeuronal acetylcholine receptor subunit alpha-7(Rattus norvegicus (Rat))
Universit£
Curated by ChEMBL
LigandPNGBDBM50357065(CHEMBL1917232)
Affinity DataKi:  2.00E+4nM. Assay description: Displacement of [125I]alpha-bungarotoxin from alpha7 nAChR in Sprague-Dawley rat cerebral cortex by beta counting
In DepthDetails ArticlePubMed
TargetNeuronal acetylcholine receptor subunit alpha-7(Rattus norvegicus (Rat))
Universit£
Curated by ChEMBL
LigandPNGBDBM50357065(CHEMBL1917232)
Affinity DataKi:  2.00E+4nM. Assay description: Displacement of [125I]alpha-bungarotoxin from alpha7nAChR in rat hippocampus membranes preincubated for 5 mins followed by [125I]alpha-bungarotoxin a...
In DepthDetails ArticlePubMed