BDBM50357152 CHEMBL1917466
SMILES Cn1nc(ccc1=O)-c1ccc(CCN2CCCC2)cc1
InChI Key InChIKey=LDXDTQGGVQBLFC-UHFFFAOYSA-N
Data  2 KI
  Tab Delimited (TSV)   2D SDfile   Computed 3D by Vconf -m prep SDfile
Find this compound or compounds like it in BindingDB:
Activity Spreadsheet -- Enzyme Inhibition Constant Data from BindingDB
Found 2 hits for monomerid = 50357152
TargetHistamine H3 receptor(Homo sapiens (Human))
Cephalon
Curated by ChEMBL
LigandPNGBDBM50357152(CHEMBL1917466)
Affinity DataKi:  83nM. Assay description: Displacement of [3H]NAMH from human H3R expressed in CHO cells
In DepthDetails ArticlePubMed
TargetHistamine H3 receptor(Rattus norvegicus (rat))
Cephalon
Curated by ChEMBL
LigandPNGBDBM50357152(CHEMBL1917466)
Affinity DataKi:  135nM. Assay description: Displacement of [3H]NAMH from rat H3R expressed in CHO cells
In DepthDetails ArticlePubMed