BDBM50357155 CHEMBL1917639
SMILES C[C@@H]1CCCN1CCc1ccc(cc1)-c1ccc(=O)n(n1)-c1ccc(Cl)cc1
InChI Key InChIKey=VNILVLXMZOAUEX-QGZVFWFLSA-N
Data  2 KI
  Tab Delimited (TSV)   2D SDfile   Computed 3D by Vconf -m prep SDfile
Find this compound or compounds like it in BindingDB:
Activity Spreadsheet -- Enzyme Inhibition Constant Data from BindingDB
Found 2 hits for monomerid = 50357155
TargetHistamine H3 receptor(Homo sapiens (Human))
Cephalon
Curated by ChEMBL
LigandPNGBDBM50357155(CHEMBL1917639)
Affinity DataKi:  8nM. Assay description: Displacement of [3H]NAMH from human H3R expressed in CHO cells
In DepthDetails ArticlePubMed
TargetHistamine H3 receptor(Rattus norvegicus (rat))
Cephalon
Curated by ChEMBL
LigandPNGBDBM50357155(CHEMBL1917639)
Affinity DataKi:  26nM. Assay description: Displacement of [3H]NAMH from rat H3R expressed in CHO cells
In DepthDetails ArticlePubMed