BDBM50357230 CHEMBL1229563
SMILES O[C@H]1CN[C@H](C1)C(O)=O
InChI Key InChIKey=PMMYEEVYMWASQN-QWWZWVQMSA-N
Data  1 KI
  Tab Delimited (TSV)   2D SDfile   Computed 3D by Vconf -m prep SDfile
Find this compound or compounds like it in BindingDB:
Activity Spreadsheet -- Enzyme Inhibition Constant Data from BindingDB
Found 1 hit for monomerid = 50357230
TargetProton-coupled amino acid transporter 1(Homo sapiens (Human))
Martin-Luther-University Halle-Wittenberg
Curated by ChEMBL
LigandPNGBDBM50357230(CHEMBL1229563)
Affinity DataKi:  3.30E+6nM. Assay description: Inhibition of human PAT1-mediated L-[3H]proline uptake in human Caco2 cells after 10 mins by liquid scintillation countingChecked by Author
In DepthDetails ArticlePubMed