BDBM50357416 CHEMBL1917302
SMILES OC[C@H]1O[C@@H]([C@@H](O)[C@@H](O)[C@@H]1O)n1cc(COc2ccccc2)nn1
InChI Key InChIKey=LONVUAYEINAMEC-MRLBHPIUSA-N
Data  1 IC50
  Tab Delimited (TSV)   2D SDfile   Computed 3D by Vconf -m prep SDfile
Find this compound or compounds like it in BindingDB:
Activity Spreadsheet -- Enzyme Inhibition Constant Data from BindingDB
Found 1 hit for monomerid = 50357416
TargetType 1 fimbrin D-mannose specific adhesin(Escherichia coli (strain K12))
University Of Basel
Curated by ChEMBL
LigandPNGBDBM50357416(CHEMBL1917302)
Affinity DataIC50:  493nM. Assay description: Antagonist activity at Escherichia coli recombinant C-terminal 6His-tagged FimH-CRD with a C-terminal thrombin cleavage site expressed in Escherichia...
In DepthDetails ArticlePubMed